{"text_format":"1","workbook":"xlsx","n_sheets":5,"sheets":["images","opciones","ARMARIOS","BATERÍAS","INDEX"],"not_rendered":{"charts":0,"images":36,"macros":1,"external_links":0,"defined_names":26,"comments":2,"pivot_tables":0},"unopened":[],"bounds":{"document_bytes":16777216,"sheet_cells":100000,"rows_first":2000,"rows_last":500,"rows_between":2000,"halvings":0,"cell_chars":16384,"cell_head_chars":4096},"cells_cut":0,"cells_raw":0,"read":"whole","date_system":"1900"}

{"sheet":"images","index":0,"n_rows":18,"n_cols":32,"rows_kept":18,"cut":false,"hidden":true,"merged":[]}
["ALL IMAGES",null,null,null,{"$f":"+ARMARIOS!D4","v":0},{"$f":"IF(E1=\"COBRE\",\"Tubería de cobre Ø\",IF(E1=\"ACERO\",\"Tubería de acero Ø\",IF(E1=\"PE\",\"Tubería de PE Ø\",\"Tubería de inox Ø\")))&ARMARIOS!E4","v":"Tubería de inox Ø"},null,null,null,null,null,null,null,null,null,null,null,null,{"$f":"IF(ARMARIOS!D11=\"NO\",\"NO\",ARMARIOS!D11&ARMARIOS!H11)","v":"NO"},{"$f":"IF(ARMARIOS!D13=\"NO\",\"NO\",ARMARIOS!D13&ARMARIOS!H13)","v":""},{"$f":"IF(ARMARIOS!D15=\"NO\",\"NO\",ARMARIOS!D15&ARMARIOS!H15)","v":""},null,{"$f":"IF(ARMARIOS!K4=\"Regulación sólo\",\"Regulación sólo\",IF(ARMARIOS!M6=\"SI\",\"CON contador \"&ARMARIOS!K4,\"SIN contador - \"&ARMARIOS!K4))","v":"SIN contador - "},{"$f":"IF(LEFT(W1,3)=\"CON\",\"Con contador \"&ARMARIOS!K4,IF(LEFT(W1,3)=\"SIN\",\"Con soporte para \"&ARMARIOS!K4,\"Regulación sólo\"))","v":"Con soporte para "},null,null,{"$f":"+ARMARIOS!G4","v":0},{"$f":"IF(AA1=\"COBRE\",\"Tubería de cobre Ø\",IF(AA1=\"ACERO\",\"Tubería de acero Ø\",IF(AA1=\"PE\",\"Tubería de PE Ø\",\"Tubería de inox Ø\")))&ARMARIOS!H4","v":"Tubería de inox Ø"}]
["objeto","imagen","opciones",null,"ENTRADA",{"$f":"INDEX(images!$E$3:$F$6,MATCH(ARMARIOS!$B$20,images!$E$3:$E$6,0),2)","v":0},null,null,"TOMAENTRADA",{"$f":"INDEX(images!$I$3:$J$8,MATCH(ARMARIOS!$D$8,images!$I$3:$I$8,0),2)","v":{"$error":"#N/A"}},null,"FILTROSINO",{"$f":"INDEX(images!$L$3:$M$4,MATCH(ARMARIOS!$D$9,images!$L$3:$L$4,0),2)","v":{"$error":"#N/A"}},null,"REGULADORONO",{"$f":"INDEX(images!$O$3:$P$7,MATCH(ARMARIOS!$D$10,images!$O$3:$O$7,0),2)","v":{"$error":"#N/A"}},null,"LLAVE1-3",{"$f":"INDEX(images!$R$3:$S$8,MATCH(images!$S$1,images!$R$3:$R$8,0),2)","v":0},{"$f":"INDEX(images!$R$3:$S$8,MATCH(images!$T$1,images!$R$3:$R$8,0),2)","v":{"$error":"#N/A"}},{"$f":"INDEX(images!$R$3:$S$8,MATCH(images!$U$1,images!$R$3:$R$8,0),2)","v":{"$error":"#N/A"}},null,"CONTADORSINO",{"$f":"INDEX(images!$W$3:$X$5,MATCH(images!$X$1,images!$W$3:$W$5,0),2)","v":"\n\nSoporte para  \n\n\n"},null,null,"SALIDA",{"$f":"INDEX(images!$AA$3:$AB$6,MATCH(ARMARIOS!$N$20,images!$AA$3:$AA$6,0),2)","v":0},null,"TODASTOMAS",{"$f":"INDEX(images!$AD$3:$AE$13,MATCH(ARMARIOS!$D$12,images!$AD$3:$AD$13,0),2)","v":{"$error":"#N/A"}},{"$f":"INDEX(images!$AD$3:$AE$13,MATCH(ARMARIOS!$D$16,images!$AD$3:$AD$13,0),2)","v":{"$error":"#N/A"}}]
["Nada",null,null,null,{"$f":"\"Tubería de cobre Ø\" & ARMARIOS!E4","v":"Tubería de cobre Ø"},null,"---",null,"Llave",null,"---","NO",null,null,"Sin regulador",null,"---","SI",null,"---",null,null,{"$f":"IF(LEFT(W1,3)=\"CON\",\"Con contador \" & ARMARIOS!K4,\"Sin contador\")","v":"Sin contador"},{"$f":"+\"      \"& ARMARIOS!K4&\" \n\n  \"","v":"       \n\n  "},"---",null,{"$f":"\"Tubería de cobre Ø\" & ARMARIOS!H4","v":"Tubería de cobre Ø"},null,"---","Llave",null,"---"]
["Regulador",null,null,null,{"$f":"\"Tubería de acero Ø\" & ARMARIOS!E4","v":"Tubería de acero Ø"},null,"---",null,"Toma de presión",null,"---","SI",null,"---","Regulador sin seguridades",null,"---","NO",null,"---",null,null,{"$f":"\"Con soporte para \"& ARMARIOS!K4","v":"Con soporte para "},{"$f":"\"\n\nSoporte para \"&ARMARIOS!K4&\" \n\n\n\"","v":"\n\nSoporte para  \n\n\n"},"---",null,{"$f":"\"Tubería de acero Ø\" & ARMARIOS!H4","v":"Tubería de acero Ø"},null,"---","Toma de presión",null,"---"]
["Llave",null,null,null,{"$f":"\"Tubería de PE Ø\" & ARMARIOS!E4","v":"Tubería de PE Ø"},null,"---",null,"Toma en la tubería de entrada y después llave",null,"---",null,null,null,"Regulador con VIS MAX",null,"---",{"$f":"\"SI\"&opciones!G28","v":"SIDe palanca"},null,"---",null,null,"Regulación sólo",null,"---",null,{"$f":"\"Tubería de PE Ø\" & ARMARIOS!H4","v":"Tubería de PE Ø"},null,"---","Toma en la tubería de entrada y después llave",null,"---"]
["Toma de presión",null,"> 150mbar Peterson\n< 150 mbar Débil Calibre",null,{"$f":"\"Tubería de inox Ø\" & ARMARIOS!E4","v":"Tubería de inox Ø"},null,"---",null,null,null,null,null,null,null,"Regulador con VIS MIN",null,"---",{"$f":"\"SI\"&opciones!G29","v":"SIDe mariposa"},null,"---",null,null,null,null,null,null,{"$f":"\"Tubería de inox Ø\" & ARMARIOS!H4","v":"Tubería de inox Ø"},null,"---",null,null,"---"]
["Válvula de 3 vías",null,null,null,null,null,null,null,"Llave con toma incorporada",null,"---",null,null,null,"Regulador con VIS MIN & MAX",null,"---",{"$f":"\"SI\"&opciones!G30","v":"SIDe bola"},null,"---",null,null,null,null,null,null,null,null,null,"Llave con toma incorporada",null,"---"]
["Contador",null,null,null,null,null,null,null,"Llave con manómetro",null,"---",null,null,null,null,null,null,"SINO",null,"---",null,null,null,null,null,null,null,null,null,"Llave con manómetro",null,"---"]
["Manometro",null,null,null,null,null,null,null,"Válvula con mínima",null,"---",null,null,null,null,null,null,null,null,null,null,null,null,null,null,null,null,null,null,"Toma de presión Peterson",null,"---"]
["Regulador con VIS MAX",null,null,null,null,null,null,null,null,null,null,null,null,null,null,null,null,null,null,null,null,null,null,null,null,null,null,null,null,"Toma de presión con manómetro",null,"---"]
{"$rows_left_out":9}
{"sheet":"opciones","index":1,"n_rows":110,"n_cols":57,"rows_kept":110,"cut":false,"hidden":true,"merged":[]}
[null,null,null,null,null,null,null,null,null,null,null,"DIAMETROS",null,null,null,null,null,null,null,null,null,"BATERIAS",null,null,null,null,null,null,"mins",{"$f":"+MIN(AD3:AD98)","v":348.33333333333331},{"$f":"+MIN(AE3:AE98)","v":300},null,null,null,null,null,null,null,null,null,null,null,null,null,null,null,null,null,null," "]
["CONTADORES",null,null,null,null,null,null,null,"GAS","GLP",null,null,"COBRE","ACERO","PE","ACERO_INOX",null,"Regulación sólo",null,null,"HELPER","TIPO","DESCRIPCION","CONTADORES VERTICAL","CONTADORES HORIZONTAL","CONTADORES TOTAL","ALTO BATERIA","ANCHO BATERIA","FONDO BATERIA","ESPACIO VERTICAL","ESPACIO HORIZONTAL","ALTO ARMARIO","ANCHO ARMARIO","FONDO ARMARIO",null,null,null,"TIPO DE ARMARIO / BATERIA",null,null,null,null,null,null,null,null,null,null,"Martigrap baterias en ARMARIOS"]
["Modelo","Modelo","Caudal MAX","Presión trabajo","Conexiones","Caudal MIN","OPCION",null,null,"GN",null,null,"15 mm","20 mm","10 mm","12 mm",null,"1 x G-4",null,null,{"$f":"+V3&TEXT(Z3,\"00\")","v":"GLP MPB02"},"GLP MPB",{"$f":"\"Batería con \"&X3&\" verticales y \"&Y3&\" horizontales. Total: \"&Z3&\" contadores.\"","v":"Batería con 2 verticales y 1 horizontales. Total: 2 contadores."},2,1,{"$f":"+Y3*X3","v":2},1030,500,270,{"$f":"+AA3/X3","v":515},{"$f":"+AB3/Y3","v":500},null,null,270,null,null,null,null,"Batería sin armario",null,null,"Convertidor de presión:"]
["1 x G-4","G-4","6 m3/h","0,5 bar","MxM 7/8\"","0,04 m3/h",1,null,null,null,null,null,"18 mm","32 mm","15 mm","15 mm",null,"2 x G-4",null,null,"GLP MPB02","GLP MPB","Batería con 1 verticales y 2 horizontales. Total: 2 contadores.",1,2,2,600,700,270,600,350,null,null,270,null,null,null,null,"Armario galvanizado",null,null,null,null,null,null,null,null,null,"TIPO","Martigrap code","Size","total","layout","vertical","horizontal","Real space","removed"]
["2 x G-4","G-4","6 m3/h","0,5 bar","MxM 7/8\"","0,04 m3/h",2,null,null,null,null,null,"22 mm","40 mm","20 mm","18 mm",null,"G-6",null,null,"GLP MPB03","GLP MPB","Batería con 3 verticales y 1 horizontales. Total: 3 contadores.",3,1,3,1415,500,270,471.66666666666669,500,900,770,270,null,"900x770x270",null,null,null,null,null,null,"AS IS","number","units","BAR","EQUIV",null,"GN MPA",7402100000,"1070x770x400",3,"2+1",2,2,{"$f":"+BC5*BB5","v":4},{"$f":"(BB5*BC5)-AZ5","v":1}]
["G-6","G-6","10 m3/h","0,5 bar","MxM 1 1/4\"","0,06 m3/h",3,null,null,null,null,null,"28 mm","63 mm","25 mm","22 mm",null,"G-16",null,null,"GLP MPB03","GLP MPB","Batería con 1 verticales y 3 horizontales. Total: 3 contadores.",1,3,3,600,1000,270,600,333.33333333333331,900,770,270,null,"900x770x270",null,null,null,null,null,"entrada:",{"$f":"+BATERÍAS!E4","v":0},{"$f":"VALUE(TRIM(SUBSTITUTE(SUBSTITUTE(UPPER(AQ6),\"MBAR\",\"\"),\"BAR\",\"\")))","v":0},{"$f":"+IF(RIGHT(AQ6,4)=\"mbar\",\"MBAR\",IF(RIGHT(AQ6,4)=\"MBAR\",\"MBAR\",\"BAR\"))","v":"BAR"},{"$f":"+IF(AS6=\"BAR\",AR6,AR6/1000)","v":0},{"$f":"VLOOKUP(AT6,$J$19:$L$24,3)","v":{"$error":"#DIV/0!"}},null,"GN MPA",7402200000,"1070x770x400",4,"2+2",2,2,{"$f":"+BC6*BB6","v":4},{"$f":"(BB6*BC6)-AZ6","v":0}]
["G-16","G-16","25 m3/h","0,5 bar","MxM 2\"","0,16 m3/h",4,null,"MATERIAL","COBRE",null,null,"35 mm","90 mm","32 mm","28 mm",null,"G-25",null,null,"GLP MPB04","GLP MPB","Batería con 4 verticales y 1 horizontales. Total: 4 contadores.",4,1,4,1800,500,270,450,500,900,770,270,null,"900x770x270",null,null,null,null,null,null,null,null,null,null,null,null,"GN MPA",7412210000,"1070x1540x400",5,"2+2+1",2,3,6,1]
["G-25","G-25","40 m3/h","0,5 bar","MxM 2 1/2\"","0,25 m3/h",5,null,null,"ACERO",null,null,"42 mm","110 mm","40 mm","35 mm",null,"G-40",null,null,"GLP MPB04","GLP MPB","Batería con 1 verticales y 4 horizontales. Total: 4 contadores.",1,4,4,600,1300,270,600,325,900,770,270,null,"900x770x270",null,null,null,null,null,"salida:",{"$f":"IF(BATERÍAS!H4=\"\",0,BATERÍAS!H4)","v":0},{"$f":"VALUE(TRIM(SUBSTITUTE(SUBSTITUTE(UPPER(AQ8),\"MBAR\",\"\"),\"BAR\",\"\")))","v":0},{"$f":"+IF(RIGHT(AQ8,4)=\"mbar\",\"MBAR\",IF(RIGHT(AQ8,4)=\"MBAR\",\"MBAR\",\"BAR\"))","v":"BAR"},{"$f":"+IF(AS8=\"BAR\",AR8,AR8/1000)","v":0},{"$f":"VLOOKUP(AT8,$J$19:$L$24,3)","v":{"$error":"#DIV/0!"}},null,"GN MPA",7403200000,"1500x770x400",5,"3+2",3,2,6,1]
["G-40","G-40","65 m3/h","0,5 bar","DN 65","0,4 m3/h",6,null,null,"PE",null,null,"54 mm",null,"50 mm","42 mm",null,"G-65",null,null,"GLP MPB04","GLP MPB","Batería con 2 verticales y 2 horizontales. Total: 4 contadores.",2,2,4,1030,700,270,515,350,900,770,270,null,"900x770x270",null,"TIPO DE GAS",null,null,null,null,null,null,null,null,null,null,"GN MPA",7412220000,"1070x1540x400",6,"2+2+2",2,3,6,0]
["G-65","G-65","100 m3/h","0,5 bar","DN 80","0,65 m3/h",7,null,null,"ACERO_INOX",null,null,null,null,"65 mm",null,null,"G-100",null,null,"GLP MPB05","GLP MPB","Batería con 5 verticales y 1 horizontales. Total: 5 contadores.",5,1,5,2185,500,270,437,500,1350,770,270,null,"1350x770x270",null,null,"GLP MPA",null,null,null,null,null,null,null,null,null,"GN MPA",7403300000,"1500x770x400",6,"3+3",3,2,6,0]
{"$rows_left_out":101}
{"sheet":"ARMARIOS","index":2,"n_rows":21,"n_cols":24,"rows_kept":21,"cut":false,"hidden":true,"merged":[[11,1,11,2],[11,3,11,6],[12,1,12,2],[14,1,14,2],[10,1,10,2],[7,3,7,6],[9,3,9,4],[5,9,5,10],[5,1,5,7],[7,1,7,2],[8,1,8,2],[9,1,9,2],[7,9,7,12],[19,9,19,10],[20,1,20,13],[15,1,15,2],[15,3,15,6],[17,4,17,5],[17,9,17,10],[16,1,16,2]]}
[null,"CONFIGURADOR DE ARMARIOS DE REGULACIÓN DE ANCARGAS",null,null,null,null,null,null,null,null,null,null,null,null,null,null,{"$f":"IF(OR(K4=\"\",K4=\"Regulación sólo\"),\"\",VLOOKUP(K4,opciones!A3:G13,7,FALSE))","v":""},"Llaves",null,"Para contador(es)",null,"Tomas en Entrada","Tomas Antes del Contador","Tomas en SALIDA"]
[null,null,null,null,null,null,null,{"$f":"IF(ISERROR(opciones!F23),\"\",opciones!F23)","v":""},{"$f":"IF(H2=\"\",\"\",\">a>\")","v":""},{"$f":"IF(ISERROR(opciones!F25),\"\",opciones!F25)","v":""},{"$f":"IF(opciones!E25>opciones!E23,\"OJO: Presión de Salida > Entrada\",\"\")","v":""},null,null,null,null,null,"GAS",{"$f":"+opciones!G28","v":"De palanca"},null,{"$f":"+opciones!R2","v":"Regulación sólo"},null,{"$f":"+images!I3","v":"Llave"},{"$f":"+opciones!J37","v":"Toma de presión Peterson"},{"$f":"+opciones!O37","v":"Toma de presión débil calibre"}]
[null,"Gas","Presión de entrada (bar/mbar)","Material Entrada","Diámetro Entrada","Presión de salida (bar/mbar)","Material Salida","Diámetro Salida","Conexión de Salida","Caudal\n(m3/h)","PARA Contador(es)","Presión de trabajo","Conexiones Contador","Caudal Max.",null,null,{"$f":"+opciones!J2","v":"GLP"},{"$f":"+opciones!G29","v":"De mariposa"},null,{"$f":"+opciones!R3","v":"1 x G-4"},"rearme",{"$f":"+images!I4","v":"Toma de presión"},{"$f":"+opciones!J38","v":"Válvula de 3 vías con manómetro"},{"$f":"+opciones!O38","v":"Toma de presión Peterson"}]
[null,null,null,null,null,null,null,null,null,null,null,{"$f":"IF(ISERROR(VLOOKUP(K4,opciones!$A$4:$E$13,4,FALSE)),\"-\",VLOOKUP(K4,opciones!$A$4:$E$13,4,FALSE))","v":"-"},{"$f":"IF(ISERROR(VLOOKUP(K4,opciones!$A$4:$E$13,5,FALSE)),\"-\",VLOOKUP(K4,opciones!$A$4:$E$13,5,FALSE))","v":"-"},{"$f":"IF(ISERROR(VLOOKUP(K4,opciones!$A$4:$E$13,3,FALSE)),\"-\",VLOOKUP(K4,opciones!$A$4:$E$13,3,FALSE))","v":"-"},null,null,{"$f":"+opciones!J3","v":"GN"},{"$f":"+opciones!G30","v":"De bola"},null,{"$f":"+opciones!R4","v":"2 x G-4"},{"$f":"+opciones!M28","v":"Manual"},{"$f":"+images!I5","v":"Toma en la tubería de entrada y después llave"},{"$f":"+opciones!J39","v":"Válvula de 3 vías enchufe rápido con manómetro"},{"$f":"+opciones!O39","v":"Válvula con mínima"}]
[null,null,null,{"$f":"IF(D4=\"PE\",\"Salvo indicaciones al contrario, SDR 11\",\"\")","v":""},null,null,{"$f":"IF(G4=\"PE\",\"Salvo indicaciones al contrario, SDR 11\",\"\")","v":""},null,null,{"$f":"IF(opciones!C41>opciones!C43,\"OJO: Caudal Máx. del contador es \" & N4,\"\")","v":""},null,null,{"$f":"IF(OR(K4=T6,K4=T8,K4=T9,K4=T10),\"Indicar medidas \"& K4,\"\")","v":""},null,null,null,null,null,null,{"$f":"+opciones!R5","v":"G-6"},{"$f":"+opciones!M29","v":"Automático"},{"$f":"+images!I7","v":"Llave con toma incorporada"}]
[null,"Esta hoja está pensada para AYUDAR a configurar y visualizar el armario de regulación / medición que quieres. Igualmente, se puede adaptar cualquier armario a cualquier indicación específica que tengas. Las opciones presentadas aquí NO son de ninguna manera exhaustivas.",null,null,null,null,null,null,"Con armario:",null,null,"Con contador:",null,null,null,null,"materiales","armario",null,{"$f":"+opciones!R6","v":"G-16"},null,{"$f":"+images!I8","v":"Llave con manómetro"}]
[null,"OPCIONES / CONFIGURACIONES ESPECÍFICAS:",null,null,null,"PARA CUALQUIER DUDA, CONSÚLTANOS!!",null,null,null,{"$f":"IF(ISNUMBER(FIND(\"con mirilla\",J6)),IF(OR(K4=T3,K4=T4),\"\",\"No se puede servir un armario con mirilla para \"&K4),\"\")","v":""},null,null,null,null,null,null,{"$f":"+opciones!J7","v":"COBRE"},{"$f":"+opciones!J29","v":"Sin armario"},null,{"$f":"+opciones!R7","v":"G-25"}]
[null,"Toma de presión / llave de entrada:",null,null,null,null,null,null,null,{"$f":"IF(I4=Q13,IF(K4<>\"Regulación sólo\",\"La conexión rosca / tuerca de salida sería de 1''\",\"La conexión rosca / tuerca de salida sería de 1½'' o 2½''\"),\"\")","v":""},null,null,null,null,null,null,{"$f":"+opciones!J8","v":"ACERO"},{"$f":"+opciones!J30","v":"Con armario con mirilla (G-4)"},null,{"$f":"+opciones!R8","v":"G-40"},null,"Form Complete?"]
[null,"Filtro:",null,null,null,null,null,null,null,null,null,null,null,null,null,null,{"$f":"+opciones!J9","v":"PE"},{"$f":"+opciones!J31","v":"Con armario sin mirilla"},null,{"$f":"+opciones!R9","v":"G-65"},null,{"$f":"IF(COUNTIF(V10:W21,\"YES\")=21,\"COMPLETE\",\"INCOMPLETE\")","v":"INCOMPLETE"},"Some are NOT needed (marked YES \"hard coded\")"]
[null,"Regulador:",null,null,null,{"$f":"IF(H2=\"\",\"\",IF(H2=\"MPA\",\"* VIS MIN Obligatorio para MPA\",IF(H2=\"MPB\",\"* VIS MIN MAX Obligatorio para MPB\",\"\")))","v":""},{"$f":"IF(ISNUMBER(FIND(\"VIS\",D10)),\"Rearme:\",\"\")","v":""},null,null,null,null,null,null,null,null,null,{"$f":"+opciones!J10","v":"ACERO_INOX"},null,null,{"$f":"+opciones!R10","v":"G-100"},null,{"$f":"+IF(B4<>\"\",\"YES\",\"NO\")","v":"NO"},"YES"]
{"$rows_left_out":12}
{"sheet":"BATERÍAS","index":3,"n_rows":24,"n_cols":38,"rows_kept":24,"cut":false,"hidden":true,"merged":[[2,11,2,13],[23,1,23,13],[5,1,5,7],[5,9,5,10],[6,8,6,9]]}
[null,"CONFIGURADOR DE BATERIAS PARA CONTADORES DE ANCARGAS",null,null,null,null,null,null,null,null,null,null,null,null,null,null,"Next time open file:","TIPO de armario",null,"Entrada",null,"Material"]
[null,null,null,null,null,null,null,{"$f":"IF(ISERROR(opciones!AU6),\"\",opciones!AU6)","v":""},{"$f":"IF(H2=\"\",\"\",\">a>\")","v":""},{"$f":"IF(ISERROR(opciones!AU8),\"\",opciones!AU8)","v":""},{"$f":"IF(opciones!AT8>opciones!AT6,\"OJO: Presión de Salida > Entrada\",\"\")","v":""},null,null,null,null,null,"As a user",{"$f":"+opciones!AM3","v":"Batería sin armario"},"Open Options","A",null,{"$f":"+opciones!J7","v":"COBRE"}]
[null,"Gas","No. total de contadores","PARA Contadores","Presión de entrada (bar/mbar)","Material Entrada","Diámetro Entrada","Presión de salida (bar/mbar)","Material Salida","Diametro Salida","Selecciona tu configuración:",null,null,null,null,null,null,{"$f":"+opciones!AM4","v":"Armario galvanizado"},"As a user","B",null,{"$f":"+opciones!J8","v":"ACERO"}]
[null,null,null,"G-4",null,"COBRE",null,{"$f":"IF(B4=\"GLP\",S6,IF(B4=\"GN\",S7,\"\"))","v":""},"COBRE",{"$f":"IF(B4=\"GLP\",S9,IF(B4=\"GN\",S10,\"\"))","v":""},{"$f":"IF(ISERROR(U21),\"\",IF(C4=U21,\"Estructura de la batería:\",IF(C4<U21,IF(U21-C4=1,\"Se  quitará 1 contador\",IF(U21-C4>1,\"Se quitarán \"&U21-C4&\" contadores\",\"\")))))","v":""},{"$f":"IF(ISERROR(R21),\"\",\"Alto:\n\"&R21& \" mm\")","v":""},{"$f":"IF(ISERROR(S21),\"\",\"Ancho:\n\"&S21& \" mm\")","v":""},{"$f":"IF(ISERROR(T21),\"\",\"Fondo:\n\"&T21& \" mm\")","v":""},null,null,"Form Completed?",null,"In editor Mode","C",null,{"$f":"+opciones!J9","v":"PE"}]
[null,null,null,null,{"$f":"IF(opciones!AT6>opciones!K22,\"La presión de entrada debe ser BP, MPA o MPB\",\"\")","v":""},null,null,null,null,{"$f":"IF(C4>S17,\"Consultarnos! El número máximo habitual es \"&S17,\"\")","v":""},null,null,null,null,null,null,{"$f":"IF(COUNTIF(Q6:Q13,\"YES\")=8,\"COMPLETE\",\"INCOMPLETE\")","v":"INCOMPLETE"},null,null,"D",null,{"$f":"+opciones!J10","v":"ACERO_INOX"}]
[null,"Esta hoja está pensada para AYUDAR a configurar y visualizar una batería de centralización de contadores. Igualmente, podemos adaptarnos a cualquier configuración que tengas.",null,null,null,null,null,null,"Armario:",null,null,"Con contadores:",null,null,null,null,{"$f":"+IF(B4<>\"\",\"YES\",\"\")","v":""},null,"150 mbar","E"]
[null,{"$f":"IF(Q5<>\"COMPLETE\",\"Por favor completa todos los campos\",\"\")","v":"Por favor completa todos los campos"},null,null,null,null,null,null,"Selecciona la entrada\ndel gráfico:",null,null,"Ubicación de la entrada:",null,null,null,null,{"$f":"+IF(C4<>\"\",\"YES\",\"\")","v":""},null,"22 mbar","F"]
[null,"DETALLE DE LA CONFIGURACION:",null,null,"PARA CUALQUIER DUDA - CONSULTANOS!!",null,null,null,null,null,null,null,null,null,null,null,{"$f":"+IF(AND(E4<>\"\",E5=\"\"),\"YES\",\"\")","v":""},"GAS",null,"G"]
[null,null,{"$f":"IF(Q5=\"COMPLETE\",\"La salida de la batería será por la parte superior.\",\"\")","v":""},null,null,null,null,null,null,null,null,null,null,null,null,null,{"$f":"+IF(G4<>\"\",\"YES\",\"\")","v":""},{"$f":"+opciones!J2","v":"GLP"},"15 mm","H"]
[null,null,{"$f":"IF(Q5=\"COMPLETE\",IF(J6=R2,\"La batería se suministrará sin armario.\",\"La batería se suministrará con armario de dimensiones:\"),\"\")","v":""},null,null,null,null,null,null,null,null,null,null,null,null,null,{"$f":"+IF(L3<>\"\",\"YES\",\"\")","v":""},{"$f":"+opciones!J3","v":"GN"},"22 mm"]
{"$rows_left_out":15}
{"sheet":"INDEX","index":4,"n_rows":23,"n_cols":3,"rows_kept":23,"cut":false,"hidden":false,"merged":[[20,1,20,13],[6,1,6,13],[22,1,22,13],[18,1,18,13],[3,2,4,10]]}
[]
[]
[]
[null,null,"Este documento Excel debería funcionar correctamente con su versión de Excel. Asegúrase con los macros estén habilitados."]
[]
[]
[null,"Bienvenidos al configurador de Armarios y Baterías de Ancargas"]
[]
[]
[]
{"$rows_left_out":13}